{"text_format":"1","workbook":"xlsx","n_sheets":8,"sheets":["Ref Score sheet","Team Sheets","Scoring Sheet","Replacements","Whatsapp","Notes","Calculations","Codes"],"not_rendered":{"charts":0,"images":1,"macros":1,"external_links":0,"defined_names":5,"comments":0,"pivot_tables":0},"unopened":[],"bounds":{"document_bytes":16777216,"sheet_cells":100000,"rows_first":2000,"rows_last":500,"rows_between":2000,"halvings":0,"cell_chars":16384,"cell_head_chars":4096},"cells_cut":0,"cells_raw":0,"read":"whole","date_system":"1900"}

{"sheet":"Ref Score sheet","index":0,"n_rows":124,"n_cols":27,"rows_kept":124,"cut":false,"hidden":false,"merged":[[17,15,17,23],[0,15,1,19],[91,3,91,4],[64,5,64,7],[65,5,65,7],[50,3,50,4],[51,3,51,4],[52,3,52,4],[63,5,63,7],[62,5,62,7],[60,5,60,7],[61,5,61,7],[54,5,54,7],[55,5,55,7],[58,5,58,7],[59,5,59,7],[56,5,56,7],[57,5,57,7],[72,3,72,4],[54,3,54,4],[71,3,71,4],[62,3,62,4],[63,3,63,4],[64,3,64,4],[3,16,3,19],[9,9,9,13],[10,9,10,13],[11,9,11,13],[2,16,2,19],[93,3,93,4],[94,3,94,4],[107,3,107,4],[74,3,74,4],[75,3,75,4],[76,3,76,4],[90,3,90,4],[79,3,79,4],[80,3,80,4],[81,3,81,4],[82,3,82,4],[83,3,83,4],[84,3,84,4],[85,3,85,4],[89,3,89,4],[88,3,88,4],[77,3,77,4],[78,3,78,4],[86,3,86,4],[87,3,87,4],[92,3,92,4],[108,3,108,4],[101,3,101,4],[102,3,102,4],[105,3,105,4],[106,3,106,4],[95,3,95,4],[96,3,96,4],[99,3,99,4],[103,3,103,4],[104,3,104,4],[97,3,97,4],[98,3,98,4],[100,3,100,4],[123,3,123,4],[113,3,113,4],[116,3,116,4],[117,3,117,4],[109,3,109,4],[110,3,110,4],[111,3,111,4],[112,3,112,4],[114,3,114,4],[118,3,118,4],[119,3,119,4],[120,3,120,4],[121,3,121,4],[122,3,122,4],[115,3,115,4],[25,3,25,4],[26,3,26,4],[28,3,28,4],[32,3,32,4],[33,3,33,4],[53,3,53,4],[48,3,48,4],[49,3,49,4],[38,3,38,4],[39,3,39,4],[40,3,40,4],[41,3,41,4],[42,3,42,4],[43,3,43,4],[44,3,44,4],[45,3,45,4],[46,3,46,4],[47,3,47,4],[34,3,34,4],[35,3,35,4],[36,3,36,4],[37,3,37,4],[27,3,27,4],[30,3,30,4],[123,11,123,13],[15,8,15,10],[15,11,15,13],[119,11,119,13],[120,11,120,13],[121,11,121,13],[122,11,122,13],[110,11,110,13],[111,11,111,13],[112,11,112,13],[106,11,106,13],[102,11,102,13],[103,11,103,13],[104,11,104,13],[105,11,105,13],[118,11,118,13],[81,11,81,13],[82,11,82,13],[83,11,83,13],[84,11,84,13],[72,11,72,13],[73,11,73,13],[74,11,74,13],[75,11,75,13],[55,3,55,4],[60,3,60,4],[61,3,61,4],[56,3,56,4],[57,3,57,4],[73,3,73,4],[58,3,58,4],[59,3,59,4],[66,3,66,4],[65,3,65,4],[67,3,67,4],[68,3,68,4],[69,3,69,4],[70,3,70,4],[76,11,76,13],[77,11,77,13],[78,11,78,13],[79,11,79,13],[80,11,80,13],[117,11,117,13],[108,11,108,13],[109,11,109,13],[90,11,90,13],[91,11,91,13],[100,11,100,13],[87,11,87,13],[98,11,98,13],[99,11,99,13],[96,11,96,13],[97,11,97,13],[113,11,113,13],[114,11,114,13],[115,11,115,13],[116,11,116,13],[107,11,107,13],[111,8,111,10],[112,8,112,10],[76,8,76,10],[77,8,77,10],[74,8,74,10],[75,8,75,10],[78,8,78,10],[106,8,106,10],[101,8,101,10],[73,8,73,10],[72,8,72,10],[97,8,97,10],[98,8,98,10],[99,8,99,10],[100,8,100,10],[91,8,91,10],[92,8,92,10],[89,8,89,10],[123,5,123,7],[119,5,119,7],[120,5,120,7],[121,5,121,7],[122,5,122,7],[95,8,95,10],[96,8,96,10],[119,8,119,10],[107,8,107,10],[108,8,108,10],[102,8,102,10],[103,8,103,10],[104,8,104,10],[122,8,122,10],[123,8,123,10],[113,8,113,10],[114,8,114,10],[115,8,115,10],[116,8,116,10],[117,8,117,10],[120,8,120,10],[118,8,118,10],[117,5,117,7],[121,8,121,10],[118,5,118,7],[110,5,110,7],[111,5,111,7],[115,5,115,7],[116,5,116,7],[79,8,79,10],[80,8,80,10],[90,8,90,10],[85,8,85,10],[86,8,86,10],[87,8,87,10],[88,8,88,10],[83,8,83,10],[84,8,84,10],[106,5,106,7],[107,5,107,7],[93,8,93,10],[94,8,94,10],[81,8,81,10],[82,8,82,10],[96,5,96,7],[105,8,105,10],[109,8,109,10],[110,8,110,10],[89,5,89,7],[113,5,113,7],[114,5,114,7],[108,5,108,7],[109,5,109,7],[112,5,112,7],[104,5,104,7],[105,5,105,7],[100,5,100,7],[101,5,101,7],[103,5,103,7],[98,5,98,7],[99,5,99,7],[82,5,82,7],[83,5,83,7],[94,5,94,7],[95,5,95,7],[102,5,102,7],[101,11,101,13],[92,11,92,13],[93,11,93,13],[85,11,85,13],[86,11,86,13],[94,11,94,13],[95,11,95,13],[88,11,88,13],[89,11,89,13],[84,5,84,7],[85,5,85,7],[97,5,97,7],[86,5,86,7],[87,5,87,7],[90,5,90,7],[91,5,91,7],[92,5,92,7],[93,5,93,7],[88,5,88,7],[78,5,78,7],[79,5,79,7],[80,5,80,7],[81,5,81,7],[76,5,76,7],[77,5,77,7],[66,5,66,7],[67,5,67,7],[68,5,68,7],[69,5,69,7],[72,5,72,7],[73,5,73,7],[70,5,70,7],[71,5,71,7],[74,5,74,7],[75,5,75,7],[66,11,66,13],[67,11,67,13],[68,11,68,13],[67,8,67,10],[69,11,69,13],[71,8,71,10],[70,8,70,10],[70,11,70,13],[64,11,64,13],[65,11,65,13],[64,8,64,10],[65,8,65,10],[66,8,66,10],[68,8,68,10],[69,8,69,10],[71,11,71,13],[63,11,63,13],[60,8,60,10],[61,8,61,10],[59,11,59,13],[58,8,58,10],[59,8,59,10],[62,8,62,10],[46,11,46,13],[47,11,47,13],[48,11,48,13],[49,11,49,13],[52,11,52,13],[58,11,58,13],[53,11,53,13],[54,11,54,13],[55,11,55,13],[50,11,50,13],[51,11,51,13],[56,11,56,13],[57,11,57,13],[63,8,63,10],[60,11,60,13],[61,11,61,13],[62,11,62,13],[44,11,44,13],[28,11,28,13],[29,11,29,13],[30,11,30,13],[31,11,31,13],[45,11,45,13],[40,11,40,13],[41,11,41,13],[42,11,42,13],[43,11,43,13],[35,11,35,13],[38,11,38,13],[32,11,32,13],[33,11,33,13],[34,11,34,13],[39,11,39,13],[53,8,53,10],[48,8,48,10],[49,8,49,10],[25,8,25,10],[26,8,26,10],[27,8,27,10],[28,8,28,10],[29,8,29,10],[50,8,50,10],[51,8,51,10],[47,8,47,10],[37,8,37,10],[38,8,38,10],[39,8,39,10],[40,8,40,10],[41,8,41,10],[42,8,42,10],[43,8,43,10],[33,8,33,10],[46,8,46,10],[45,8,45,10],[34,8,34,10],[35,8,35,10],[31,8,31,10],[42,5,42,7],[34,5,34,7],[35,5,35,7],[57,8,57,10],[54,8,54,10],[55,8,55,10],[43,5,43,7],[36,5,36,7],[37,5,37,7],[50,5,50,7],[51,5,51,7],[52,5,52,7],[53,5,53,7],[44,8,44,10],[48,5,48,7],[49,5,49,7],[38,5,38,7],[39,5,39,7],[44,5,44,7],[45,5,45,7],[46,5,46,7],[47,5,47,7],[56,8,56,10],[52,8,52,10],[41,5,41,7],[32,8,32,10],[30,8,30,10],[36,8,36,10],[23,11,23,13],[24,11,24,13],[25,11,25,13],[26,11,26,13],[27,11,27,13],[36,11,36,13],[37,11,37,13],[26,5,26,7],[27,5,27,7],[28,5,28,7],[25,5,25,7],[24,5,24,7],[23,8,23,10],[21,11,21,13],[22,11,22,13],[29,5,29,7],[30,5,30,7],[31,5,31,7],[32,5,32,7],[33,5,33,7],[40,5,40,7],[11,3,11,7],[18,3,18,4],[18,5,18,7],[19,3,19,4],[18,8,18,10],[19,8,19,10],[20,8,20,10],[21,8,21,10],[22,8,22,10],[12,9,12,13],[29,3,29,4],[31,3,31,4],[21,3,21,4],[22,3,22,4],[23,3,23,4],[24,3,24,4],[10,0,11,2],[24,8,24,10],[20,3,20,4],[16,3,16,4],[17,3,17,4],[20,5,20,7],[16,5,16,7],[17,5,17,7],[5,9,5,13],[14,3,14,7],[13,3,13,7],[18,11,18,13],[19,11,19,13],[15,3,15,7],[16,11,16,13],[17,11,17,13],[20,11,20,13],[21,5,21,7],[22,5,22,7],[23,5,23,7],[16,8,16,10],[17,8,17,10],[19,5,19,7],[10,3,10,7],[2,3,2,13],[14,0,14,2],[9,0,9,2],[0,5,0,7],[4,0,4,2],[1,0,1,13],[4,3,4,7],[0,9,0,13],[8,0,8,2],[13,0,13,2],[5,0,5,2],[6,0,6,2],[7,0,7,2],[12,0,12,2],[5,3,5,5],[6,3,6,5],[7,3,7,5],[8,3,8,7],[9,3,9,7],[13,9,13,13],[4,8,4,13],[6,9,6,13],[7,9,7,13],[8,9,8,13]]}
[null,null,null,null,null,"SOUTH AFRICAN RUGBY UNION MATCH SCORE SHEET",null,null,null,"SA Rugby Stats 2024 v1",null,null,null,null,null,"Sub/Replace Count"]
[]
[null,null,"e-mail to:","eddieg@sarugby.co.za; mwprugby@gmail.com; mornen@sarugby.co.za; jaco@evolveav.co.za; eugenev@sarugby.co.za; matchcoding@mobii.com; Zingi.Hela@sarugby.co.za",null,null,null,null,null,null,null,null,null,null,{"$f":"Q3","v":0},"H",{"$f":"COUNTIFS($B$16:$B$123,P3,$C$16:$C$123,Codes!$D$1)+COUNTIFS($B$16:$B$123,P3,$C$16:$C$123,Codes!$D$2)+COUNTIFS($B$16:$B$123,P3,$C$16:$C$123,Codes!#REF!)+COUNTIFS($B$16:$B$123,P3,$C$16:$C$123,Codes!$D$3)","v":0}]
[null,null,"Any internet connection problems the final score must be “SMS” shortly after the final whistle to Eddie/Zingi 082 693 5917/072 631 2846",null,null,null,null,null,null,null,null,null,null,null,{"$f":"Q4","v":0},"A",{"$f":"COUNTIFS($B$16:$B$123,P4,$C$16:$C$123,Codes!$D$1)+COUNTIFS($B$16:$B$123,P4,$C$16:$C$123,Codes!$D$2)+COUNTIFS($B$16:$B$123,P4,$C$16:$C$123,+COUNTIFS($B$16:$B$123,P4,$C$16:$C$123,Codes!$D$3))","v":0}]
["Competition:",null,null,null,null,null,null,null,"Match Officials Names:"]
["MATCH DETAILS:",null,null,"Team",null,null,"Half time score","Full time score","Referee :"]
{"$rows_left_out":119}
{"sheet":"Team Sheets","index":1,"n_rows":30,"n_cols":10,"rows_kept":30,"cut":false,"hidden":false,"merged":[[0,1,0,5]]}
[null,"Run-on Teams",null,null,null,null,null,"Summary"]
[null,"HOME TEAM",null,null,"AWAY TEAM",null,null,null,"H","A"]
[null,1,null,null,1,null,null,"Tries",{"$f":"Calculations!$B$120","v":0},{"$f":"Calculations!$AI$120","v":0}]
[null,2,null,null,2,null,null,"Penalty Tries",{"$f":"Calculations!$C$120","v":0},{"$f":"Calculations!$AJ$120","v":0}]
[null,3,null,null,3,null,null,"Conversions",{"$f":"Calculations!$D$120","v":0},{"$f":"Calculations!$AK$120","v":0}]
[null,4,null,null,4,null,null,"Penalties",{"$f":"Calculations!$E$120","v":0},{"$f":"Calculations!$AL$120","v":0}]
{"$rows_left_out":25}
{"sheet":"Scoring Sheet","index":2,"n_rows":31,"n_cols":16,"rows_kept":31,"cut":false,"hidden":false,"merged":[[0,3,0,7],[0,11,0,15]]}
[null,null,"Home Team Final Score",{"$f":"(D31*5)+(E31*2)+(F31*3)+(G31*3)+(H31*7)","v":0},null,null,null,null,null,null,"Away Team Final Score",{"$f":"(L31*5)+(M31*2)+(N31*3)+(O31*3)+(P31*7)","v":0}]
[null,null,{"$f":"'Ref Score sheet'!D7","v":0},"T","C","P","DG","PT",null,null,{"$f":"'Ref Score sheet'!D8","v":0},"T","C","P","DG","PT"]
[null,{"$f":"'Team Sheets'!B3","v":1},{"$f":"IF('Team Sheets'!C3=\"\",\"\",'Team Sheets'!C3)","v":""},{"$f":"COUNTIFS('Ref Score sheet'!$B$17:$B$124,\"H\",'Ref Score sheet'!$C$17:$C$124,$D$2,'Ref Score sheet'!$D$17:$D$124,B3)","v":0},{"$f":"COUNTIFS('Ref Score sheet'!$B$17:$B$124,\"H\",'Ref Score sheet'!$C$17:$C$124,$E$2,'Ref Score sheet'!$D$17:$D$124,B3)","v":0},{"$f":"COUNTIFS('Ref Score sheet'!$B$17:$B$124,\"H\",'Ref Score sheet'!$C$17:$C$124,$F$2,'Ref Score sheet'!$D$17:$D$124,B3)","v":0},{"$f":"COUNTIFS('Ref Score sheet'!$B$17:$B$124,\"H\",'Ref Score sheet'!$C$17:$C$124,$G$2,'Ref Score sheet'!$D$17:$D$124,B3)","v":0},{"$f":"COUNTIFS('Ref Score sheet'!$B$17:$B$124,\"H\",'Ref Score sheet'!$C$17:$C$124,$H$2)","v":0},null,{"$f":"'Team Sheets'!E3","v":1},{"$f":"IF('Team Sheets'!F3=\"\",\"\",'Team Sheets'!F3)","v":""},{"$f":"COUNTIFS('Ref Score sheet'!$B$17:$B$124,\"A\",'Ref Score sheet'!$C$17:$C$124,$L$2,'Ref Score sheet'!$D$17:$D$124,J3)","v":0},{"$f":"COUNTIFS('Ref Score sheet'!$B$17:$B$124,\"A\",'Ref Score sheet'!$C$17:$C$124,$M$2,'Ref Score sheet'!$D$17:$D$124,J3)","v":0},{"$f":"COUNTIFS('Ref Score sheet'!$B$17:$B$124,\"A\",'Ref Score sheet'!$C$17:$C$124,$N$2,'Ref Score sheet'!$D$17:$D$124,J3)","v":0},{"$f":"COUNTIFS('Ref Score sheet'!$B$17:$B$124,\"A\",'Ref Score sheet'!$C$17:$C$124,$O$2,'Ref Score sheet'!$D$17:$D$124,J3)","v":0},{"$f":"COUNTIFS('Ref Score sheet'!$B$17:$B$124,\"A\",'Ref Score sheet'!$C$17:$C$124,$P$2)","v":0}]
[null,{"$f":"'Team Sheets'!B4","v":2},{"$f":"IF('Team Sheets'!C4=\"\",\"\",'Team Sheets'!C4)","v":""},{"$f":"COUNTIFS('Ref Score sheet'!$B$17:$B$124,\"H\",'Ref Score sheet'!$C$17:$C$124,$D$2,'Ref Score sheet'!$D$17:$D$124,B4)","v":0},{"$f":"COUNTIFS('Ref Score sheet'!$B$17:$B$124,\"H\",'Ref Score sheet'!$C$17:$C$124,$E$2,'Ref Score sheet'!$D$17:$D$124,B4)","v":0},{"$f":"COUNTIFS('Ref Score sheet'!$B$17:$B$124,\"H\",'Ref Score sheet'!$C$17:$C$124,$F$2,'Ref Score sheet'!$D$17:$D$124,B4)","v":0},{"$f":"COUNTIFS('Ref Score sheet'!$B$17:$B$124,\"H\",'Ref Score sheet'!$C$17:$C$124,$G$2,'Ref Score sheet'!$D$17:$D$124,B4)","v":0},null,null,{"$f":"'Team Sheets'!E4","v":2},{"$f":"IF('Team Sheets'!F4=\"\",\"\",'Team Sheets'!F4)","v":""},{"$f":"COUNTIFS('Ref Score sheet'!$B$17:$B$124,\"A\",'Ref Score sheet'!$C$17:$C$124,$L$2,'Ref Score sheet'!$D$17:$D$124,J4)","v":0},{"$f":"COUNTIFS('Ref Score sheet'!$B$17:$B$124,\"A\",'Ref Score sheet'!$C$17:$C$124,$M$2,'Ref Score sheet'!$D$17:$D$124,J4)","v":0},{"$f":"COUNTIFS('Ref Score sheet'!$B$17:$B$124,\"A\",'Ref Score sheet'!$C$17:$C$124,$N$2,'Ref Score sheet'!$D$17:$D$124,J4)","v":0},{"$f":"COUNTIFS('Ref Score sheet'!$B$17:$B$124,\"A\",'Ref Score sheet'!$C$17:$C$124,$O$2,'Ref Score sheet'!$D$17:$D$124,J4)","v":0}]
[null,{"$f":"'Team Sheets'!B5","v":3},{"$f":"IF('Team Sheets'!C5=\"\",\"\",'Team Sheets'!C5)","v":""},{"$f":"COUNTIFS('Ref Score sheet'!$B$17:$B$124,\"H\",'Ref Score sheet'!$C$17:$C$124,$D$2,'Ref Score sheet'!$D$17:$D$124,B5)","v":0},{"$f":"COUNTIFS('Ref Score sheet'!$B$17:$B$124,\"H\",'Ref Score sheet'!$C$17:$C$124,$E$2,'Ref Score sheet'!$D$17:$D$124,B5)","v":0},{"$f":"COUNTIFS('Ref Score sheet'!$B$17:$B$124,\"H\",'Ref Score sheet'!$C$17:$C$124,$F$2,'Ref Score sheet'!$D$17:$D$124,B5)","v":0},{"$f":"COUNTIFS('Ref Score sheet'!$B$17:$B$124,\"H\",'Ref Score sheet'!$C$17:$C$124,$G$2,'Ref Score sheet'!$D$17:$D$124,B5)","v":0},null,null,{"$f":"'Team Sheets'!E5","v":3},{"$f":"IF('Team Sheets'!F5=\"\",\"\",'Team Sheets'!F5)","v":""},{"$f":"COUNTIFS('Ref Score sheet'!$B$17:$B$124,\"A\",'Ref Score sheet'!$C$17:$C$124,$L$2,'Ref Score sheet'!$D$17:$D$124,J5)","v":0},{"$f":"COUNTIFS('Ref Score sheet'!$B$17:$B$124,\"A\",'Ref Score sheet'!$C$17:$C$124,$M$2,'Ref Score sheet'!$D$17:$D$124,J5)","v":0},{"$f":"COUNTIFS('Ref Score sheet'!$B$17:$B$124,\"A\",'Ref Score sheet'!$C$17:$C$124,$N$2,'Ref Score sheet'!$D$17:$D$124,J5)","v":0},{"$f":"COUNTIFS('Ref Score sheet'!$B$17:$B$124,\"A\",'Ref Score sheet'!$C$17:$C$124,$O$2,'Ref Score sheet'!$D$17:$D$124,J5)","v":0}]
[null,{"$f":"'Team Sheets'!B6","v":4},{"$f":"IF('Team Sheets'!C6=\"\",\"\",'Team Sheets'!C6)","v":""},{"$f":"COUNTIFS('Ref Score sheet'!$B$17:$B$124,\"H\",'Ref Score sheet'!$C$17:$C$124,$D$2,'Ref Score sheet'!$D$17:$D$124,B6)","v":0},{"$f":"COUNTIFS('Ref Score sheet'!$B$17:$B$124,\"H\",'Ref Score sheet'!$C$17:$C$124,$E$2,'Ref Score sheet'!$D$17:$D$124,B6)","v":0},{"$f":"COUNTIFS('Ref Score sheet'!$B$17:$B$124,\"H\",'Ref Score sheet'!$C$17:$C$124,$F$2,'Ref Score sheet'!$D$17:$D$124,B6)","v":0},{"$f":"COUNTIFS('Ref Score sheet'!$B$17:$B$124,\"H\",'Ref Score sheet'!$C$17:$C$124,$G$2,'Ref Score sheet'!$D$17:$D$124,B6)","v":0},null,null,{"$f":"'Team Sheets'!E6","v":4},{"$f":"IF('Team Sheets'!F6=\"\",\"\",'Team Sheets'!F6)","v":""},{"$f":"COUNTIFS('Ref Score sheet'!$B$17:$B$124,\"A\",'Ref Score sheet'!$C$17:$C$124,$L$2,'Ref Score sheet'!$D$17:$D$124,J6)","v":0},{"$f":"COUNTIFS('Ref Score sheet'!$B$17:$B$124,\"A\",'Ref Score sheet'!$C$17:$C$124,$M$2,'Ref Score sheet'!$D$17:$D$124,J6)","v":0},{"$f":"COUNTIFS('Ref Score sheet'!$B$17:$B$124,\"A\",'Ref Score sheet'!$C$17:$C$124,$N$2,'Ref Score sheet'!$D$17:$D$124,J6)","v":0},{"$f":"COUNTIFS('Ref Score sheet'!$B$17:$B$124,\"A\",'Ref Score sheet'!$C$17:$C$124,$O$2,'Ref Score sheet'!$D$17:$D$124,J6)","v":0}]
{"$rows_left_out":26}
{"sheet":"Replacements","index":3,"n_rows":29,"n_cols":14,"rows_kept":29,"cut":false,"hidden":false,"merged":[]}
[null,"Home Team",null,"RT-OFF","CON-Off","RI-OFF","HIA-Off",null,"AWAY TEAM",null,"RT-OFF","CON-Off","RI-OFF","HIA-Off"]
[null,{"$f":"'Team Sheets'!B3","v":1},{"$f":"IF('Team Sheets'!C3=\"\",\"\",'Team Sheets'!C3)","v":""},{"$f":"COUNTIFS('Ref Score sheet'!$B$17:$B$124,\"H\",'Ref Score sheet'!$C$17:$C$124,$D$1,'Ref Score sheet'!$D$17:$D$124,$B2)","v":0},{"$f":"COUNTIFS('Ref Score sheet'!$B$17:$B$124,\"H\",'Ref Score sheet'!$C$17:$C$124,$E$1,'Ref Score sheet'!$D$17:$D$124,$B2)","v":0},{"$f":"COUNTIFS('Ref Score sheet'!$B$17:$B$124,\"H\",'Ref Score sheet'!$C$17:$C$124,$F$1,'Ref Score sheet'!$D$17:$D$124,$B2)","v":0},{"$f":"COUNTIFS('Ref Score sheet'!$B$17:$B$124,\"H\",'Ref Score sheet'!$C$17:$C$124,$G$1,'Ref Score sheet'!$D$17:$D$124,$B2)","v":0},null,{"$f":"'Team Sheets'!E3","v":1},{"$f":"IF('Team Sheets'!F3=\"\",\"\",'Team Sheets'!F3)","v":""},{"$f":"COUNTIFS('Ref Score sheet'!$B$17:$B$124,\"A\",'Ref Score sheet'!$C$17:$C$124,$K$1,'Ref Score sheet'!$D$17:$D$124,I2)","v":0},{"$f":"COUNTIFS('Ref Score sheet'!$B$17:$B$124,\"A\",'Ref Score sheet'!$C$17:$C$124,$L$1,'Ref Score sheet'!$D$17:$D$124,I2)","v":0},{"$f":"COUNTIFS('Ref Score sheet'!$B$17:$B$124,\"A\",'Ref Score sheet'!$C$17:$C$124,$M$1,'Ref Score sheet'!$D$17:$D$124,I2)","v":0},{"$f":"COUNTIFS('Ref Score sheet'!$B$17:$B$124,\"A\",'Ref Score sheet'!$C$17:$C$124,$N$1,'Ref Score sheet'!$D$17:$D$124,J2)","v":0}]
[null,{"$f":"'Team Sheets'!B4","v":2},{"$f":"IF('Team Sheets'!C4=\"\",\"\",'Team Sheets'!C4)","v":""},{"$f":"COUNTIFS('Ref Score sheet'!$B$17:$B$124,\"H\",'Ref Score sheet'!$C$17:$C$124,$D$1,'Ref Score sheet'!$D$17:$D$124,$B3)","v":0},{"$f":"COUNTIFS('Ref Score sheet'!$B$17:$B$124,\"H\",'Ref Score sheet'!$C$17:$C$124,$E$1,'Ref Score sheet'!$D$17:$D$124,$B3)","v":0},{"$f":"COUNTIFS('Ref Score sheet'!$B$17:$B$124,\"H\",'Ref Score sheet'!$C$17:$C$124,$F$1,'Ref Score sheet'!$D$17:$D$124,$B3)","v":0},{"$f":"COUNTIFS('Ref Score sheet'!$B$17:$B$124,\"H\",'Ref Score sheet'!$C$17:$C$124,$G$1,'Ref Score sheet'!$D$17:$D$124,$B3)","v":0},null,{"$f":"'Team Sheets'!E4","v":2},{"$f":"IF('Team Sheets'!F4=\"\",\"\",'Team Sheets'!F4)","v":""},{"$f":"COUNTIFS('Ref Score sheet'!$B$17:$B$124,\"A\",'Ref Score sheet'!$C$17:$C$124,$K$1,'Ref Score sheet'!$D$17:$D$124,I3)","v":0},{"$f":"COUNTIFS('Ref Score sheet'!$B$17:$B$124,\"A\",'Ref Score sheet'!$C$17:$C$124,$L$1,'Ref Score sheet'!$D$17:$D$124,I3)","v":0},{"$f":"COUNTIFS('Ref Score sheet'!$B$17:$B$124,\"A\",'Ref Score sheet'!$C$17:$C$124,$M$1,'Ref Score sheet'!$D$17:$D$124,I3)","v":0},{"$f":"COUNTIFS('Ref Score sheet'!$B$17:$B$124,\"A\",'Ref Score sheet'!$C$17:$C$124,$N$1,'Ref Score sheet'!$D$17:$D$124,J3)","v":0}]
[null,{"$f":"'Team Sheets'!B5","v":3},{"$f":"IF('Team Sheets'!C5=\"\",\"\",'Team Sheets'!C5)","v":""},{"$f":"COUNTIFS('Ref Score sheet'!$B$17:$B$124,\"H\",'Ref Score sheet'!$C$17:$C$124,$D$1,'Ref Score sheet'!$D$17:$D$124,$B4)","v":0},{"$f":"COUNTIFS('Ref Score sheet'!$B$17:$B$124,\"H\",'Ref Score sheet'!$C$17:$C$124,$E$1,'Ref Score sheet'!$D$17:$D$124,$B4)","v":0},{"$f":"COUNTIFS('Ref Score sheet'!$B$17:$B$124,\"H\",'Ref Score sheet'!$C$17:$C$124,$F$1,'Ref Score sheet'!$D$17:$D$124,$B4)","v":0},{"$f":"COUNTIFS('Ref Score sheet'!$B$17:$B$124,\"H\",'Ref Score sheet'!$C$17:$C$124,$G$1,'Ref Score sheet'!$D$17:$D$124,$B4)","v":0},null,{"$f":"'Team Sheets'!E5","v":3},{"$f":"IF('Team Sheets'!F5=\"\",\"\",'Team Sheets'!F5)","v":""},{"$f":"COUNTIFS('Ref Score sheet'!$B$17:$B$124,\"A\",'Ref Score sheet'!$C$17:$C$124,$K$1,'Ref Score sheet'!$D$17:$D$124,I4)","v":0},{"$f":"COUNTIFS('Ref Score sheet'!$B$17:$B$124,\"A\",'Ref Score sheet'!$C$17:$C$124,$L$1,'Ref Score sheet'!$D$17:$D$124,I4)","v":0},{"$f":"COUNTIFS('Ref Score sheet'!$B$17:$B$124,\"A\",'Ref Score sheet'!$C$17:$C$124,$M$1,'Ref Score sheet'!$D$17:$D$124,I4)","v":0},{"$f":"COUNTIFS('Ref Score sheet'!$B$17:$B$124,\"A\",'Ref Score sheet'!$C$17:$C$124,$N$1,'Ref Score sheet'!$D$17:$D$124,J4)","v":0}]
[null,{"$f":"'Team Sheets'!B6","v":4},{"$f":"IF('Team Sheets'!C6=\"\",\"\",'Team Sheets'!C6)","v":""},{"$f":"COUNTIFS('Ref Score sheet'!$B$17:$B$124,\"H\",'Ref Score sheet'!$C$17:$C$124,$D$1,'Ref Score sheet'!$D$17:$D$124,$B5)","v":0},{"$f":"COUNTIFS('Ref Score sheet'!$B$17:$B$124,\"H\",'Ref Score sheet'!$C$17:$C$124,$E$1,'Ref Score sheet'!$D$17:$D$124,$B5)","v":0},{"$f":"COUNTIFS('Ref Score sheet'!$B$17:$B$124,\"H\",'Ref Score sheet'!$C$17:$C$124,$F$1,'Ref Score sheet'!$D$17:$D$124,$B5)","v":0},{"$f":"COUNTIFS('Ref Score sheet'!$B$17:$B$124,\"H\",'Ref Score sheet'!$C$17:$C$124,$G$1,'Ref Score sheet'!$D$17:$D$124,$B5)","v":0},null,{"$f":"'Team Sheets'!E6","v":4},{"$f":"IF('Team Sheets'!F6=\"\",\"\",'Team Sheets'!F6)","v":""},{"$f":"COUNTIFS('Ref Score sheet'!$B$17:$B$124,\"A\",'Ref Score sheet'!$C$17:$C$124,$K$1,'Ref Score sheet'!$D$17:$D$124,I5)","v":0},{"$f":"COUNTIFS('Ref Score sheet'!$B$17:$B$124,\"A\",'Ref Score sheet'!$C$17:$C$124,$L$1,'Ref Score sheet'!$D$17:$D$124,I5)","v":0},{"$f":"COUNTIFS('Ref Score sheet'!$B$17:$B$124,\"A\",'Ref Score sheet'!$C$17:$C$124,$M$1,'Ref Score sheet'!$D$17:$D$124,I5)","v":0},{"$f":"COUNTIFS('Ref Score sheet'!$B$17:$B$124,\"A\",'Ref Score sheet'!$C$17:$C$124,$N$1,'Ref Score sheet'!$D$17:$D$124,J5)","v":0}]
[null,{"$f":"'Team Sheets'!B7","v":5},{"$f":"IF('Team Sheets'!C7=\"\",\"\",'Team Sheets'!C7)","v":""},{"$f":"COUNTIFS('Ref Score sheet'!$B$17:$B$124,\"H\",'Ref Score sheet'!$C$17:$C$124,$D$1,'Ref Score sheet'!$D$17:$D$124,$B6)","v":0},{"$f":"COUNTIFS('Ref Score sheet'!$B$17:$B$124,\"H\",'Ref Score sheet'!$C$17:$C$124,$E$1,'Ref Score sheet'!$D$17:$D$124,$B6)","v":0},{"$f":"COUNTIFS('Ref Score sheet'!$B$17:$B$124,\"H\",'Ref Score sheet'!$C$17:$C$124,$F$1,'Ref Score sheet'!$D$17:$D$124,$B6)","v":0},{"$f":"COUNTIFS('Ref Score sheet'!$B$17:$B$124,\"H\",'Ref Score sheet'!$C$17:$C$124,$G$1,'Ref Score sheet'!$D$17:$D$124,$B6)","v":0},null,{"$f":"'Team Sheets'!E7","v":5},{"$f":"IF('Team Sheets'!F7=\"\",\"\",'Team Sheets'!F7)","v":""},{"$f":"COUNTIFS('Ref Score sheet'!$B$17:$B$124,\"A\",'Ref Score sheet'!$C$17:$C$124,$K$1,'Ref Score sheet'!$D$17:$D$124,I6)","v":0},{"$f":"COUNTIFS('Ref Score sheet'!$B$17:$B$124,\"A\",'Ref Score sheet'!$C$17:$C$124,$L$1,'Ref Score sheet'!$D$17:$D$124,I6)","v":0},{"$f":"COUNTIFS('Ref Score sheet'!$B$17:$B$124,\"A\",'Ref Score sheet'!$C$17:$C$124,$M$1,'Ref Score sheet'!$D$17:$D$124,I6)","v":0},{"$f":"COUNTIFS('Ref Score sheet'!$B$17:$B$124,\"A\",'Ref Score sheet'!$C$17:$C$124,$N$1,'Ref Score sheet'!$D$17:$D$124,J6)","v":0}]
{"$rows_left_out":24}
{"sheet":"Whatsapp","index":4,"n_rows":3,"n_cols":9,"rows_kept":3,"cut":false,"hidden":false,"merged":[]}
[{"$f":"'Ref Score sheet'!D5","v":0},"T","PT","C","P","DG",null,"Half Time Score","Final Score"]
[{"$f":"'Ref Score sheet'!D7","v":0},{"$f":"Calculations!B120","v":0},{"$f":"Calculations!C120","v":0},{"$f":"Calculations!D120","v":0},{"$f":"Calculations!E120","v":0},{"$f":"Calculations!F120","v":0},null,{"$f":"'Ref Score sheet'!G7","v":0},{"$f":"((B2*5)+(C2*7)+(D2*2)+(E2*3)+(F2*3))","v":0}]
[{"$f":"'Ref Score sheet'!D8","v":0},{"$f":"Calculations!AI120","v":0},{"$f":"Calculations!AJ120","v":0},{"$f":"Calculations!AK120","v":0},{"$f":"Calculations!AL120","v":0},{"$f":"Calculations!AM120","v":0},null,{"$f":"'Ref Score sheet'!G8","v":0},{"$f":"((B3*5)+(C3*7)+(D3*2)+(E3*3)+(F3*3))","v":0}]

{"sheet":"Notes","index":5,"n_rows":61,"n_cols":3,"rows_kept":61,"cut":false,"hidden":false,"merged":[[50,0,51,0],[48,0,49,0],[43,1,43,2],[3,0,10,0],[11,0,20,0],[27,0,33,0],[34,0,38,0],[21,0,26,0],[39,0,42,0],[0,0,0,2],[1,0,1,2],[2,0,2,2],[44,0,45,0],[46,0,47,0]]}
["             Notes on how to fill in Score Sheet"]
["EVENT NOTES"]
["Please keep track of the following events"]
["Scoring","T","Try"]
[null,"PT","Penalty Try - No conversion required"]
[null,"C","Conversion"]
{"$rows_left_out":56}
{"sheet":"Calculations","index":6,"n_rows":120,"n_cols":64,"rows_kept":120,"cut":false,"hidden":true,"merged":[[119,61,119,62],[119,29,119,30],[0,33,0,36]]}
["Home Team",null,null,null,null,null,null,null,null,null,null,null,null,null,null,null,null,null,null,null,null,null,null,null,null,null,null,null,null,null,null,null,null,"Away Team"]
[]
[]
[]
[]
[]
{"$rows_left_out":115}
{"sheet":"Codes","index":7,"n_rows":40,"n_cols":4,"rows_kept":40,"cut":false,"hidden":true,"merged":[]}
["T","H","Currie Cup Premier Division","RT-OFF"]
["PT","A","Currie Cup 1st Division","CON-Off"]
["C",null,"SA Cup","RI-OFF"]
["MC",null,"U19 SA Rugby Championship"]
["P",null,"U20 SA Rugby Championship"]
["MP",null,"U21 SA Rugby Championship"]
{"$rows_left_out":34}